Target
Corticotropin-releasing factor receptor 1
Ligand
BDBM50054220
Substrate
Meas. Tech.
ChEMBL_51123 (CHEMBL663558)
Ki
>10000±n/a nM
Citation
 Whitten, JPXie, YFErickson, PEWebb, TRDe Souza, EBGrigoriadis, DEMcCarthy, JR Rapid microscale synthesis, a new method for lead optimization using robotics and solution phase chemistry: application to the synthesis and optimization of corticotropin-releasing factor1 receptor antagonists. J Med Chem 39:4354-7 (1996)  
Target
Name:
Corticotropin-releasing factor receptor 1
Synonyms:
CRF-R CRF1 CRFR1 CRH-R 1 CRHR1 Corticotropin-releasing factor receptor 1 (CRF-1) Corticotropin-releasing hormone receptor 1
Type:
Enzyme
Mol. Mass.:
50744.31
Organism:
Homo sapiens (Human)
Description:
P34998
Residue:
444
  
Inhibitor
Name:
BDBM50054220
Synonyms:
CHEMBL135615 | N-Cyclopropylmethyl-6-methyl-N-propyl-N'-p-tolyl-[1,3,5]triazine-2,4-diamine
Type:
Small organic molecule
Emp. Form.:
C18H25N5
Mol. Mass.:
311.4246
SMILES:
CCCN(CC1CC1)c1nc(C)nc(Nc2ccc(C)cc2)n1
: