Target
Acyl-CoA:cholesterol acyltransferase
Ligand
BDBM50054308
Substrate
Meas. Tech.
ChEMBL_28664 (CHEMBL649062)
IC50
32±n/a nM
Citation
 White, ADCreswell, MWChucholowski, AWBlankley, CJWilson, MWBousley, RFEssenburg, ADHamelehle, KLKrause, BRStanfield, RLDominick, MANeub, M Heterocyclic ureas: inhibitors of acyl-CoA:cholesterol O-acyltransferase as hypocholesterolemic agents. J Med Chem 39:4382-95 (1996)  
Target
Name:
Acyl-CoA:cholesterol acyltransferase
Synonyms:
ACAT
Type:
Mol. Mass.:
35405.31
Organism:
Oryctolagus cuniculus
Description:
Residue:
305
  
Inhibitor
Name:
BDBM50054308
Synonyms:
1-(2,6-Diisopropyl-phenyl)-3-[2-(11-hydroxy-undecyl)-2,3-dihydro-1H-tetrazol-5-yl]-urea | CHEMBL337811
Type:
Small organic molecule
Emp. Form.:
C25H44N6O2
Mol. Mass.:
460.6559
SMILES:
CC(C)c1cccc(C(C)C)c1NC(=O)NC1=NN(CCCCCCCCCCCO)NN1
: