Target
Acyl-CoA:cholesterol acyltransferase
Ligand
BDBM50054277
Substrate
Meas. Tech.
ChEMBL_28664 (CHEMBL649062)
IC50
29±n/a nM
Citation
 White, ADCreswell, MWChucholowski, AWBlankley, CJWilson, MWBousley, RFEssenburg, ADHamelehle, KLKrause, BRStanfield, RLDominick, MANeub, M Heterocyclic ureas: inhibitors of acyl-CoA:cholesterol O-acyltransferase as hypocholesterolemic agents. J Med Chem 39:4382-95 (1996)  
Target
Name:
Acyl-CoA:cholesterol acyltransferase
Synonyms:
ACAT
Type:
Mol. Mass.:
35405.31
Organism:
Oryctolagus cuniculus
Description:
Residue:
305
  
Inhibitor
Name:
BDBM50054277
Synonyms:
1-(3-Decyl-isoxazol-5-yl)-3-(2,6-diisopropyl-phenyl)-urea | CHEMBL335557
Type:
Small organic molecule
Emp. Form.:
C26H41N3O2
Mol. Mass.:
427.6226
SMILES:
CCCCCCCCCCc1cc(NC(=O)Nc2c(cccc2C(C)C)C(C)C)on1
: