Target
Protein kinase C alpha type
Ligand
BDBM50054428
Substrate
Meas. Tech.
ChEMBL_162399 (CHEMBL769346)
IC50
3700±n/a nM
Citation
 Pereira, ERBelin, LSancelme, MPrudhomme, MOllier, MRapp, MSevère, DRiou, JFFabbro, DMeyer, T Structure-activity relationships in a series of substituted indolocarbazoles: topoisomerase I and protein kinase C inhibition and antitumoral and antimicrobial properties. J Med Chem 39:4471-7 (1996)  
Target
Name:
Protein kinase C alpha type
Synonyms:
KPCA_HUMAN PKC alpha and beta-2 PKC-alpha PRKACA Protein Kinase C- alpha Protein kinase C alpha (PKCa) Protein kinase C alpha type (PRKCA) RAF proto-oncogene serine/threonine-protein kinase
Type:
Enzyme
Mol. Mass.:
76755.65
Organism:
Homo sapiens (Human)
Description:
The recombinant human PKC enzymes were produced using a baculovirus expression system in SF9 cells
Residue:
672
  
Inhibitor
Name:
BDBM50054428
Synonyms:
13-(3,4-dihydroxy-6-hydroxymethyl-5-methoxytetrahydro-2H-2-pyranyl)-6,7,12,13-tetrahydro-5H-indolo[2,3-a]pyrrolo[3,4-c]carbazol-5-one | CHEMBL337535
Type:
Small organic molecule
Emp. Form.:
C27H25N3O6
Mol. Mass.:
487.5039
SMILES:
COC1C(CO)OC(C(O)C1O)n1c2ccccc2c2c3C(=O)NCc3c3c4ccccc4[nH]c3c12
: