Target
Prothrombin
Ligand
BDBM50054487
Substrate
Meas. Tech.
ChEMBL_207953 (CHEMBL811069)
IC50
1.80±n/a nM
Citation
 Levy, OESemple, JELim, MLReiner, JRote, WEDempsey, ERichard, BMZhang, ETulinsky, ARipka, WCNutt, RF Potent and selective thrombin inhibitors incorporating the constrained arginine mimic l-3-piperidyl(N-guanidino)alanine at P1. J Med Chem 39:4527-30 (1996)  
Target
Name:
Prothrombin
Synonyms:
Activation peptide fragment 1 Coagulation factor II Prothrombin precursor Thrombin heavy chain | Thrombin light chain
Type:
Protein
Mol. Mass.:
70029.57
Organism:
Homo sapiens (Human)
Description:
P00734
Residue:
622
  
Inhibitor
Name:
BDBM50054487
Synonyms:
CHEMBL342914 | N-[(S)-1-(1-Carbamimidoyl-piperidin-3-ylmethyl)-2-oxo-ethyl]-2-((S)-2-oxo-3-phenylmethanesulfonylamino-azepan-1-yl)-acetamide
Type:
Small organic molecule
Emp. Form.:
C24H36N6O5S
Mol. Mass.:
520.645
SMILES:
NC(=N)N1CCCC(C[C@H](NC(=O)CN2CCCC[C@H](NS(=O)(=O)Cc3ccccc3)C2=O)C=O)C1
: