Target
Prothrombin
Ligand
BDBM50054492
Substrate
Meas. Tech.
ChEMBL_208136 (CHEMBL816448)
IC50
1.1±n/a nM
Citation
 Semple, JERowley, DCBrunck, TKHa-Uong, TMinami, NKOwens, TDTamura, SYGoldman, EASiev, DVArdecky, RJCarpenter, SHGe, YRichard, BMNolan, TGHåkanson, KTulinsky, ANutt, RFRipka, WC Design, synthesis, and evolution of a novel, selective, and orally bioavailable class of thrombin inhibitors: P1-argininal derivatives incorporating P3-P4 lactam sulfonamide moieties. J Med Chem 39:4531-6 (1996)  
Target
Name:
Prothrombin
Synonyms:
Activation peptide fragment 1 Coagulation factor II Prothrombin precursor Thrombin heavy chain | Thrombin light chain
Type:
Protein
Mol. Mass.:
70029.57
Organism:
Homo sapiens (Human)
Description:
P00734
Residue:
622
  
Inhibitor
Name:
BDBM50054492
Synonyms:
(S)-4-[(R)-2-((S)-3-Carbamimidoyl-2-hydroxy-cyclohexylcarbamoyl)-pyrrolidin-1-yl]-4-oxo-3-(2-propyl-pentanoylamino)-butyric acid methyl ester | CHEMBL141574
Type:
Small organic molecule
Emp. Form.:
C25H43N5O6
Mol. Mass.:
509.6388
SMILES:
CCCC(CCC)C(=O)N[C@@H](CC(=O)OC)C(=O)N1CCC[C@@H]1C(=O)N[C@H]1CCCC(C1O)C(N)=N
: