Target
5-hydroxytryptamine receptor 1B
Ligand
BDBM50054980
Substrate
Meas. Tech.
ChEMBL_1353 (CHEMBL616538)
Ki
0.220000±n/a nM
Citation
 Halazy, SPerez, MFourrier, CPallard, IPauwels, PJPalmier, CJohn, GWValentin, JPBonnafous, RMartinez, J Serotonin dimers: application of the bivalent ligand approach to the design of new potent and selective 5-HT(1B/1D) agonists. J Med Chem 39:4920-7 (1997)  
Target
Name:
5-hydroxytryptamine receptor 1B
Synonyms:
5-HT-1B 5-HT1B 5HT1B_HUMAN HTR1DB Serotonin (5-HT) receptor Serotonin Receptor 1B
Type:
G Protein-Coupled Receptor (GPCR)
Mol. Mass.:
43579.17
Organism:
Homo sapiens (Human)
Description:
Receptor binding assays were performed using human clone stably expressed in CHO cells
Residue:
390
  
Inhibitor
Name:
BDBM50054980
Synonyms:
2-[3-(2-Amino-ethyl)-1H-indol-5-yloxy]-1-(1'-{2-[3-(2-amino-ethyl)-1H-indol-5-yloxy]-acetyl}-[4,4']bipiperidinyl-1-yl)-ethanone | CHEMBL357830
Type:
Small organic molecule
Emp. Form.:
C34H44N6O4
Mol. Mass.:
600.751
SMILES:
NCCc1c[nH]c2ccc(OCC(=O)N3CCC(CC3)C3CCN(CC3)C(=O)COc3ccc4[nH]cc(CCN)c4c3)cc12
: