Target
Sodium-dependent dopamine transporter
Ligand
BDBM50055002
Substrate
Meas. Tech.
ChEMBL_61986 (CHEMBL670591)
IC50
106±n/a nM
Citation
 Houlihan, WJBoja, JWParrino, VAKopajtic, TAKuhar, MJ Halogenated mazindol analogs as potential inhibitors of the cocaine binding site at the dopamine transporter. J Med Chem 39:4935-41 (1997)  
Target
Name:
Sodium-dependent dopamine transporter
Synonyms:
DA transporter SC6A3_RAT Sodium-dependent dopamine transporter | Sodium-dependent dopamine transporter (DAT)
Type:
Multi-pass membrane protein
Mol. Mass.:
68749.45
Organism:
Rattus norvegicus (rat)
Description:
P23977
Residue:
619
  
Inhibitor
Name:
BDBM50055002
Synonyms:
5-(4-Chloro-phenyl)-2,2-dimethyl-2,5-dihydro-3H-imidazo[2,1-a]isoindol-5-ol | CHEMBL337299
Type:
Small organic molecule
Emp. Form.:
C18H17ClN2O
Mol. Mass.:
312.793
SMILES:
CC1(C)CN2C(=N1)c1ccccc1C2(O)c1ccc(Cl)cc1
: