Target
Sodium-dependent dopamine transporter
Ligand
BDBM50055020
Substrate
Meas. Tech.
ChEMBL_61983 (CHEMBL670588)
IC50
294±n/a nM
Citation
 Houlihan, WJBoja, JWParrino, VAKopajtic, TAKuhar, MJ Halogenated mazindol analogs as potential inhibitors of the cocaine binding site at the dopamine transporter. J Med Chem 39:4935-41 (1997)  
Target
Name:
Sodium-dependent dopamine transporter
Synonyms:
DA transporter SC6A3_RAT Sodium-dependent dopamine transporter | Sodium-dependent dopamine transporter (DAT)
Type:
Multi-pass membrane protein
Mol. Mass.:
68749.45
Organism:
Rattus norvegicus (rat)
Description:
P23977
Residue:
619
  
Inhibitor
Name:
BDBM50055020
Synonyms:
5-(2-Chloro-phenyl)-2,5-dihydro-3H-imidazo[2,1-a]isoindol-5-ol | CHEMBL339841
Type:
Small organic molecule
Emp. Form.:
C16H13ClN2O
Mol. Mass.:
284.74
SMILES:
OC1(N2CCN=C2c2ccccc12)c1ccccc1Cl
: