Target
Sodium-dependent dopamine transporter
Ligand
BDBM50055004
Substrate
Meas. Tech.
ChEMBL_61983 (CHEMBL670588)
IC50
1.5±n/a nM
Citation
 Houlihan, WJBoja, JWParrino, VAKopajtic, TAKuhar, MJ Halogenated mazindol analogs as potential inhibitors of the cocaine binding site at the dopamine transporter. J Med Chem 39:4935-41 (1997)  
Target
Name:
Sodium-dependent dopamine transporter
Synonyms:
DA transporter SC6A3_RAT Sodium-dependent dopamine transporter | Sodium-dependent dopamine transporter (DAT)
Type:
Multi-pass membrane protein
Mol. Mass.:
68749.45
Organism:
Rattus norvegicus (rat)
Description:
P23977
Residue:
619
  
Inhibitor
Name:
BDBM50055004
Synonyms:
7-(4-Chloro-phenyl)-2,4,5,7-tetrahydro-3H-[1,3]diazepino[2,1-a]isoindol-7-ol | CHEMBL130255
Type:
Small organic molecule
Emp. Form.:
C18H17ClN2O
Mol. Mass.:
312.793
SMILES:
OC1(N2CCCCN=C2c2ccccc12)c1ccc(Cl)cc1
: