Target
Sodium-dependent serotonin transporter
Ligand
BDBM50055003
Substrate
Meas. Tech.
ChEMBL_201640 (CHEMBL806541)
IC50
1040±n/a nM
Citation
 Houlihan, WJBoja, JWParrino, VAKopajtic, TAKuhar, MJ Halogenated mazindol analogs as potential inhibitors of the cocaine binding site at the dopamine transporter. J Med Chem 39:4935-41 (1997)  
Target
Name:
Sodium-dependent serotonin transporter
Synonyms:
5-HT Transporter 5HT transporter Anandamid membrane transporter, AMT Monoamine transporters; Norepinephrine & serotonin Slc6a4 Sodium-dependent serotonin transporter (SERT) | imipramine receptor
Type:
Multi-pass membrane protein
Mol. Mass.:
70168.43
Organism:
Rattus norvegicus (rat)
Description:
P31652
Residue:
630
  
Inhibitor
Name:
BDBM50055003
Synonyms:
6-(4-Chloro-phenyl)-2,3,4,6-tetrahydro-pyrimido[2,1-a]isoindol-6-ol CHEMBL130477
Type:
Small organic molecule
Emp. Form.:
C17H15ClN2O
Mol. Mass.:
298.767
SMILES:
OC1(N2CCCN=C2c2ccccc12)c1ccc(Cl)cc1
: