Target
Genome polyprotein
Ligand
BDBM50055214
Substrate
Meas. Tech.
ChEMBL_393 (CHEMBL615643)
Ki
29±n/a nM
Citation
 Webber, SETikhe, JWorland, STFuhrman, SAHendrickson, TFMatthews, DALove, RAPatick, AKMeador, JWFerre, RABrown, ELDeLisle, DMFord, CEBinford, SL Design, synthesis, and evaluation of nonpeptidic inhibitors of human rhinovirus 3C protease. J Med Chem 39:5072-82 (1997)  
Target
Name:
Genome polyprotein
Synonyms:
Human rhinovirus A protease | Human rhinovirus B 3A protease
Type:
PROTEIN
Mol. Mass.:
44361.04
Organism:
Human rhinovirus B
Description:
ChEMBL_158953
Residue:
401
  
Inhibitor
Name:
BDBM50055214
Synonyms:
1-(3-Methoxy-benzyl)-2,3-dioxo-2,3-dihydro-1H-indole-5-carboxylic acid amide | CHEMBL149822
Type:
Small organic molecule
Emp. Form.:
C17H14N2O4
Mol. Mass.:
310.3041
SMILES:
COc1cccc(CN2C(=O)C(=O)c3cc(ccc23)C(N)=O)c1
: