Target
Genome polyprotein
Ligand
BDBM50055230
Substrate
Meas. Tech.
ChEMBL_393 (CHEMBL615643)
Ki
48±n/a nM
Citation
 Webber, SETikhe, JWorland, STFuhrman, SAHendrickson, TFMatthews, DALove, RAPatick, AKMeador, JWFerre, RABrown, ELDeLisle, DMFord, CEBinford, SL Design, synthesis, and evaluation of nonpeptidic inhibitors of human rhinovirus 3C protease. J Med Chem 39:5072-82 (1997)  
Target
Name:
Genome polyprotein
Synonyms:
Human rhinovirus A protease | Human rhinovirus B 3A protease
Type:
PROTEIN
Mol. Mass.:
44361.04
Organism:
Human rhinovirus B
Description:
ChEMBL_158953
Residue:
401
  
Inhibitor
Name:
BDBM50055230
Synonyms:
1-Biphenyl-4-ylmethyl-2,3-dioxo-2,3-dihydro-1H-indole-5-carboxylic acid amide | CHEMBL434661
Type:
Small organic molecule
Emp. Form.:
C22H16N2O3
Mol. Mass.:
356.374
SMILES:
NC(=O)c1ccc2N(Cc3ccc(cc3)-c3ccccc3)C(=O)C(=O)c2c1
: