Target
High affinity nerve growth factor receptor
Ligand
BDBM50505016
Substrate
Meas. Tech.
ChEMBL_1816966 (CHEMBL4316540)
EC50
390±n/a nM
Citation
 Kargbo, RB Modulation of Tropomyosin Receptor Kinase for the Treatment of Neurotrophin Diseases: Alzheimer's, Huntington's and Parkinson's. ACS Med Chem Lett 10:1590-1591 (2019)  
Target
Name:
High affinity nerve growth factor receptor
Synonyms:
2.7.10.1 NTRK1 NTRK1_HUMAN Neurotrophic tyrosine kinase receptor type 1 Synonyms=MTC TRK1-transforming tyrosine kinase protein TRKA GN Tropomyosin alpha-3 chain/High affinity nerve growth factor receptor Tropomyosin-related kinase A (TrkA) Tyrosine kinase receptor (Trk) Tyrosine kinase receptor A (Trk A) Tyrosine kinase receptor A (TrkA) p140-TrkA
Type:
Mol. Mass.:
87498.18
Organism:
Homo sapiens (Human)
Description:
P04629
Residue:
796
  
Inhibitor
Name:
BDBM50505016
Synonyms:
CHEMBL4527488
Type:
Small organic molecule
Emp. Form.:
C23H19N3O5
Mol. Mass.:
417.4141
SMILES:
CCOc1cc(ccc1Oc1ccccc1)-n1c(=O)[nH]c(=O)n(-c2ccccc2)c1=O
: