Target
Neuronal acetylcholine receptor subunit alpha-7
Ligand
BDBM50056147
Substrate
Meas. Tech.
ChEMBL_144029 (CHEMBL750444)
Ki
>10000±n/a nM
Citation
 Lin, NHGunn, DERyther, KBGarvey, DSDonnelly-Roberts, DLDecker, MWBrioni, JDBuckley, MJRodrigues, ADMarsh, KGAnderson, DJBuccafusco, JJPrendergast, MASullivan, JPWilliams, MArneric, SPHolladay, MW Structure-activity studies on 2-methyl-3-(2(S)-pyrrolidinylmethoxy) pyridine (ABT-089): an orally bioavailable 3-pyridyl ether nicotinic acetylcholine receptor ligand with cognition-enhancing properties. J Med Chem 40:385-90 (1997)  
Target
Name:
Neuronal acetylcholine receptor subunit alpha-7
Synonyms:
ACHA7_HUMAN Cholinergic, Nicotinic Alpha7 Neuronal acetylcholine receptor protein alpha-7 subunit Nicotinic acetylcholine receptor alpha-7 (alpha7 nAChR)
Type:
Mol. Mass.:
56448.33
Organism:
Homo sapiens (Human)
Description:
CHRNA7 (NACHRA7)
Residue:
502
  
Inhibitor
Name:
BDBM50056147
Synonyms:
2-Methyl-3-((S)-1-pyrrolidin-2-ylmethoxy)-pyridine CHEMBL127071
Type:
Small organic molecule
Emp. Form.:
C11H16N2O
Mol. Mass.:
192.2575
SMILES:
Cc1ncccc1OC[C@@H]1CCCN1
: