Target
Macrophage metalloelastase
Ligand
BDBM50505151
Substrate
Meas. Tech.
ChEMBL_1821480 (CHEMBL4321140)
Ki
1.000000±n/a nM
Citation
 Talma, MMa?lanka, MMucha, A Recent developments in the synthesis and applications of phosphinic peptide analogs. Bioorg Med Chem Lett 29:1031-1042 (2019)  
Target
Name:
Macrophage metalloelastase
Synonyms:
HME MMP12_HUMAN Matrix metalloproteinase-12 (MMP 12) Matrix metalloproteinase-12 (MMP12) | Matrix metalloproteinases 12 (MMP-12)
Type:
Enzyme
Mol. Mass.:
54012.99
Organism:
Homo sapiens (Human)
Description:
P39900
Residue:
470
  
Inhibitor
Name:
BDBM50505151
Synonyms:
CHEMBL4520279
Type:
Small organic molecule
Emp. Form.:
C41H55F3N7O11P
Mol. Mass.:
913.9009
SMILES:
[3H]CC([3H])C(=O)NCCCOCCOCCOCCCNC(=O)[C@H](CO)NC(=O)[C@H](CC)NC(=O)[C@H](Cc1cc(no1)-c1ccc(cc1)C1(N=N1)C(F)(F)F)CP(O)(=O)c1ccccc1
: