Target
Leukotriene A-4 hydrolase
Ligand
BDBM50505153
Substrate
Meas. Tech.
ChEMBL_1821476 (CHEMBL4321136)
Ki
5.3±n/a nM
Citation
 Talma, MMa?lanka, MMucha, A Recent developments in the synthesis and applications of phosphinic peptide analogs. Bioorg Med Chem Lett 29:1031-1042 (2019)  
Target
Name:
Leukotriene A-4 hydrolase
Synonyms:
LKHA4_HUMAN LTA4 Leukotriene A(4) hydrolase Leukotriene A4 hydrolase
Type:
Hydrolase; metalloprotease
Mol. Mass.:
69280.41
Organism:
Homo sapiens (Human)
Description:
Human recombinant LTA4H.
Residue:
611
  
Inhibitor
Name:
BDBM50505153
Synonyms:
CHEMBL4543986
Type:
Small organic molecule
Emp. Form.:
C14H26N3O6P
Mol. Mass.:
363.3465
SMILES:
C[C@H](N)P(O)(=O)CC1(CCN(CC1)C(C)=O)C(=O)N[C@@H](C)C(O)=O
: