Target
Macrophage metalloelastase
Ligand
BDBM50505154
Substrate
Meas. Tech.
ChEMBL_1821472 (CHEMBL4321132)
Ki
0.260000±n/a nM
Citation
 Talma, MMa?lanka, MMucha, A Recent developments in the synthesis and applications of phosphinic peptide analogs. Bioorg Med Chem Lett 29:1031-1042 (2019)  
Target
Name:
Macrophage metalloelastase
Synonyms:
HME MMP12_HUMAN Matrix metalloproteinase-12 (MMP 12) Matrix metalloproteinase-12 (MMP12) | Matrix metalloproteinases 12 (MMP-12)
Type:
Enzyme
Mol. Mass.:
54012.99
Organism:
Homo sapiens (Human)
Description:
P39900
Residue:
470
  
Inhibitor
Name:
BDBM50505154
Synonyms:
CHEMBL4581500
Type:
Small organic molecule
Emp. Form.:
C33H33BrClN4O8P
Mol. Mass.:
759.968
SMILES:
C[C@H](NC(=O)[C@H](Cc1cc(no1)-c1ccc(cc1)-c1cccc(Cl)c1)CP(O)(=O)c1ccc(Br)cc1)C(=O)N[C@@H](CCC(O)=O)C(N)=O
: