Target
Sodium channel protein type 2 subunit alpha
Ligand
BDBM145591
Substrate
Meas. Tech.
ChEMBL_1822228 (CHEMBL4321992)
IC50
2.0±n/a nM
Citation
 Mulcahy, JVPajouhesh, HBeckley, JTDelwig, ADu Bois, JHunter, JC Challenges and Opportunities for Therapeutics Targeting the Voltage-Gated Sodium Channel Isoform Na J Med Chem 62:8695-8710 (2019)  
Target
Name:
Sodium channel protein type 2 subunit alpha
Synonyms:
HBSC II SCN2A SCN2A2 Sodium (Site 2) Sodium channel protein type 2 alpha subunit Voltage-gated sodium channel subunit alpha Nav1.2
Type:
Enzyme
Mol. Mass.:
227954.68
Organism:
Homo sapiens (Human)
Description:
Q99250
Residue:
2005
  
Inhibitor
Name:
BDBM145591
Synonyms:
US8952169, 389
Type:
Small organic molecule
Emp. Form.:
C23H30FNO4S
Mol. Mass.:
435.552
SMILES:
CC1(COc2cc(F)c(cc2C2CC2)C(=O)NS(=O)(=O)C2CC2)CCC2(CC2)CC1
: