Target
Prostaglandin G/H synthase 1
Ligand
BDBM50056999
Substrate
Meas. Tech.
ChEMBL_158764 (CHEMBL772925)
IC50
50000±n/a nM
Citation
 Lazer, ESMiao, CKCywin, CLSorcek, RWong, HCMeng, ZPotocki, IHoermann, MSnow, RJTschantz, MAKelly, TAMcNeil, DWCoutts, SJChurchill, LGraham, AGDavid, EGrob, PMEngel, WMeier, HTrummlitz, G Effect of structural modification of enol-carboxamide-type nonsteroidal antiinflammatory drugs on COX-2/COX-1 selectivity. J Med Chem 40:980-9 (1997)  
Target
Name:
Prostaglandin G/H synthase 1
Synonyms:
COX-1 Cyclooxygenase Cyclooxygenase-1 (COX-1) PTGS1 | Prostaglandin G/H synthase (cyclooxygenase)
Type:
Enzyme
Mol. Mass.:
68692.62
Organism:
Homo sapiens (Human)
Description:
P23219
Residue:
599
  
Inhibitor
Name:
BDBM50056999
Synonyms:
CHEMBL56367 | nimesulide
Type:
Small organic molecule
Emp. Form.:
C13H12N2O5S
Mol. Mass.:
308.31
SMILES:
CS(=O)(=O)Nc1ccc(cc1Oc1ccccc1)[N+]([O-])=O
: