Target
72 kDa type IV collagenase
Ligand
BDBM50057062
Substrate
Meas. Tech.
ChEMBL_104543 (CHEMBL718930)
Ki
22±n/a nM
Citation
 Esser, CKBugianesi, RLCaldwell, CGChapman, KTDurette, PLGirotra, NNKopka, IELanza, TJLevorse, DAMacCoss, MOwens, KAPonpipom, MMSimeone, JPHarrison, RKNiedzwiecki, LBecker, JWMarcy, AIAxel, MGChristen, AJMcDonnell, JMoore, VLOlszewski, JMSaphos, CVisco, DMHagmann, WK Inhibition of stromelysin-1 (MMP-3) by P1'-biphenylylethyl carboxyalkyl dipeptides. J Med Chem 40:1026-40 (1997)  
Target
Name:
72 kDa type IV collagenase
Synonyms:
72 kDa gelatinase CLG4A Gelatinase A (MMP-2) MMP2_HUMAN Matrix metalloproteinase-2 (MMP 2) Matrix metalloproteinases 2 (MMP-2) | TBE-1
Type:
Enzyme
Mol. Mass.:
73870.36
Organism:
Homo sapiens (Human)
Description:
P08253
Residue:
660
  
Inhibitor
Name:
BDBM50057062
Synonyms:
(2S,4R)-2-Butyl-4-[(S)-2,2-dimethyl-1-(pyridin-4-ylcarbamoyl)-propylcarbamoyl]-6-(4-propyl-phenyl)-hexanoic acid | CHEMBL9028
Type:
Small organic molecule
Emp. Form.:
C31H45N3O4
Mol. Mass.:
523.7067
SMILES:
CCCC[C@@H](C[C@@H](CCc1ccc(CCC)cc1)C(=O)N[C@H](C(=O)Nc1ccncc1)C(C)(C)C)C(O)=O
: