Target
72 kDa type IV collagenase
Ligand
BDBM50057084
Substrate
Meas. Tech.
ChEMBL_104543 (CHEMBL718930)
Ki
32±n/a nM
Citation
 Esser, CKBugianesi, RLCaldwell, CGChapman, KTDurette, PLGirotra, NNKopka, IELanza, TJLevorse, DAMacCoss, MOwens, KAPonpipom, MMSimeone, JPHarrison, RKNiedzwiecki, LBecker, JWMarcy, AIAxel, MGChristen, AJMcDonnell, JMoore, VLOlszewski, JMSaphos, CVisco, DMHagmann, WK Inhibition of stromelysin-1 (MMP-3) by P1'-biphenylylethyl carboxyalkyl dipeptides. J Med Chem 40:1026-40 (1997)  
Target
Name:
72 kDa type IV collagenase
Synonyms:
72 kDa gelatinase CLG4A Gelatinase A (MMP-2) MMP2_HUMAN Matrix metalloproteinase-2 (MMP 2) Matrix metalloproteinases 2 (MMP-2) | TBE-1
Type:
Enzyme
Mol. Mass.:
73870.36
Organism:
Homo sapiens (Human)
Description:
P08253
Residue:
660
  
Inhibitor
Name:
BDBM50057084
Synonyms:
4'-[(3R,5S)-5-Carboxy-3-((S)-2,2-dimethyl-1-methylcarbamoyl-propylcarbamoyl)-nonyl]-biphenyl-4-carboxylic acid methyl ester | CHEMBL8888
Type:
Small organic molecule
Emp. Form.:
C32H44N2O6
Mol. Mass.:
552.7016
SMILES:
CCCC[C@@H](C[C@@H](CCc1ccc(cc1)-c1ccc(cc1)C(=O)OC)C(=O)N[C@H](C(=O)NC)C(C)(C)C)C(O)=O
: