Target
72 kDa type IV collagenase
Ligand
BDBM50057070
Substrate
Meas. Tech.
ChEMBL_104543 (CHEMBL718930)
Ki
280±n/a nM
Citation
 Esser, CKBugianesi, RLCaldwell, CGChapman, KTDurette, PLGirotra, NNKopka, IELanza, TJLevorse, DAMacCoss, MOwens, KAPonpipom, MMSimeone, JPHarrison, RKNiedzwiecki, LBecker, JWMarcy, AIAxel, MGChristen, AJMcDonnell, JMoore, VLOlszewski, JMSaphos, CVisco, DMHagmann, WK Inhibition of stromelysin-1 (MMP-3) by P1'-biphenylylethyl carboxyalkyl dipeptides. J Med Chem 40:1026-40 (1997)  
Target
Name:
72 kDa type IV collagenase
Synonyms:
72 kDa gelatinase CLG4A Gelatinase A (MMP-2) MMP2_HUMAN Matrix metalloproteinase-2 (MMP 2) Matrix metalloproteinases 2 (MMP-2) | TBE-1
Type:
Enzyme
Mol. Mass.:
73870.36
Organism:
Homo sapiens (Human)
Description:
P08253
Residue:
660
  
Inhibitor
Name:
BDBM50057070
Synonyms:
(2S,4R)-6-(3'-Amino-biphenyl-4-yl)-2-butyl-4-((S)-2,2-dimethyl-1-phenylcarbamoyl-propylcarbamoyl)-hexanoic acid | CHEMBL9102
Type:
Small organic molecule
Emp. Form.:
C35H45N3O4
Mol. Mass.:
571.7495
SMILES:
CCCC[C@@H](C[C@@H](CCc1ccc(cc1)-c1cccc(N)c1)C(=O)N[C@H](C(=O)Nc1ccccc1)C(C)(C)C)C(O)=O
: