Target
Endothelin-1 receptor
Ligand
BDBM50057179
Substrate
Meas. Tech.
ChEMBL_65465 (CHEMBL682105)
IC50
1.4±n/a nM
Citation
 Patt, WCEdmunds, JJRepine, JTBerryman, KAReisdorph, BRLee, CPlummer, MSShahripour, AHaleen, SJKeiser, JAFlynn, MAWelch, KMReynolds, EERubin, RTobias, BHallak, HDoherty, AM Structure-activity relationships in a series of orally active gamma-hydroxy butenolide endothelin antagonists. J Med Chem 40:1063-74 (1997)  
Target
Name:
Endothelin-1 receptor
Synonyms:
EDNRA ET-A ETA-R Endothelin receptor type A hET-AR
Type:
Enzyme Catalytic Domain
Mol. Mass.:
48736.88
Organism:
Homo sapiens (Human)
Description:
P25101
Residue:
427
  
Inhibitor
Name:
BDBM50057179
Synonyms:
3-Benzo[1,3]dioxol-5-yl-4-(3,4-dimethoxy-benzyl)-5-hydroxy-5-(4-methoxy-phenyl)-5H-furan-2-one | CHEMBL268480
Type:
Small organic molecule
Emp. Form.:
C27H24O8
Mol. Mass.:
476.4747
SMILES:
COc1ccc(cc1)C1(O)OC(=O)C(=C1Cc1ccc(OC)c(OC)c1)c1ccc2OCOc2c1
: