Target
Mu-type opioid receptor
Ligand
BDBM50057384
Substrate
Meas. Tech.
ChEMBL_145163 (CHEMBL753423)
Ki
210±n/a nM
Citation
 Arttamangkul, SIshmael, JEMurray, TFGrandy, DKDeLander, GEKieffer, BLAldrich, JV Synthesis and opioid activity of conformationally constrained dynorphin A analogues. 2. Conformational constraint in the"address" sequence. J Med Chem 40:1211-8 (1997)  
Target
Name:
Mu-type opioid receptor
Synonyms:
M-OR-1 Mu opioid receptor OPIATE Mu OPRM_CAVPO
Type:
Enzyme Catalytic Domain
Mol. Mass.:
11165.58
Organism:
GUINEA PIG
Description:
P97266
Residue:
98
  
Inhibitor
Name:
BDBM50057384
Synonyms:
Analog of Dynorphin A | CHEMBL2370831
Type:
Small organic molecule
Emp. Form.:
C75H122N22O16
Mol. Mass.:
1587.909
SMILES:
[#6]-[#6]-[#6@H](-[#6])-[#6@H](-[#7]-[#6](=O)-[#6@H](-[#6]-[#6]-[#6]\[#7]=[#6](\[#7])-[#7])-[#7]-[#6](=O)-[#6@H]-1-[#6]-[#6]-[#7]-[#6](=O)-[#6@H](-[#6]-[#6](-[#6])-[#6])-[#7]-[#6](=O)-[#6@@H](-[#6]-c2ccccc2)-[#7]-[#6](=O)-[#6@H](-[#6]-[#6](=O)-[#7]-1)-[#7]-[#6](=O)-[#6]-[#7]-[#6](=O)-[#6@@H](-[#7])-[#6]-c1ccc(-[#8])cc1)-[#6](=O)-[#7]-[#6@@H](-[#6]-[#6]-[#6]\[#7]=[#6](\[#7])-[#7])-[#6](=O)-[#7]-1-[#6]-[#6]-[#6]-[#6@H]-1-[#6](=O)-[#7]-[#6@@H](-[#6]-[#6]-[#6]-[#6]-[#7])-[#6](=O)-[#7]-[#6@@H](-[#6]-[#6](-[#6])-[#6])-[#6](=O)-[#7]-[#6@@H](-[#6]-[#6]-[#6]-[#6]-[#7])-[#6](-[#8])=O
: