Target
Reverse transcriptase/RNaseH
Ligand
BDBM50057823
Substrate
Meas. Tech.
ChEMBL_197125 (CHEMBL803726)
EC50
65000±n/a nM
Citation
 Adams, DRPerez, CMaillard, MFlorent, JCEvers, MHénin, YLitvak, SLitvak, LMonneret, CGrierson, DS Preparation and anti-HIV activity of N-3-substituted thymidine nucleoside analogs. J Med Chem 40:1550-8 (1997)  
Target
Name:
Reverse transcriptase/RNaseH
Synonyms:
HIV-1 Reverse Transcriptase RNase H Reverse transcriptase/RNaseH
Type:
PROTEIN
Mol. Mass.:
65229.15
Organism:
Human immunodeficiency virus 1
Description:
ChEMBL_1473730
Residue:
566
  
Inhibitor
Name:
BDBM50057823
Synonyms:
3-Allyl-1-(4-azido-5-hydroxymethyl-tetrahydro-furan-2-yl)-5-methyl-1H-pyrimidine-2,4-dione | CHEMBL290470
Type:
Small organic molecule
Emp. Form.:
C13H17N5O4
Mol. Mass.:
307.3052
SMILES:
Cc1cn(C2CC(N=[N+]=[N-])C(CO)O2)c(=O)n(CC=C)c1=O
: