Target
Chymotrypsinogen A
Ligand
BDBM50058989
Substrate
Meas. Tech.
ChEMBL_34106 (CHEMBL649735)
IC50
8000±n/a nM
Citation
 Niwata, SFukami, HSumida, MIto, AKakutani, SSaitoh, MSuzuki, KImoto, MShibata, HImajo, SKiso, YTanaka, TNakazato, HIshihara, TTakai, SYamamoto, DShiota, NMiyazaki, MOkunishi, HKinoshita, AUrata, HArakawa, K Substituted 3-(phenylsulfonyl)-1-phenylimidazolidine-2,4-dione derivatives as novel nonpeptide inhibitors of human heart chymase. J Med Chem 40:2156-63 (1997)  
Target
Name:
Chymotrypsinogen A
Synonyms:
Alpha-chymotrypsin Chymotrypsin A Chymotrypsin A chain B Chymotrypsinogen A | alpha-Chymotrypsin (α-Chymotrypsin)
Type:
Serine protease
Mol. Mass.:
25670.88
Organism:
Bos taurus (bovine)
Description:
Residue:
245
  
Inhibitor
Name:
BDBM50058989
Synonyms:
3-(4-Nitro-benzenesulfonyl)-1-phenyl-imidazolidine-2,4-dione | CHEMBL69009
Type:
Small organic molecule
Emp. Form.:
C15H11N3O6S
Mol. Mass.:
361.329
SMILES:
[O-][N+](=O)c1ccc(cc1)S(=O)(=O)N1C(=O)CN(C1=O)c1ccccc1
: