Target
Chymotrypsinogen A
Ligand
BDBM50059007
Substrate
Meas. Tech.
ChEMBL_34106 (CHEMBL649735)
IC50
1800±n/a nM
Citation
 Niwata, SFukami, HSumida, MIto, AKakutani, SSaitoh, MSuzuki, KImoto, MShibata, HImajo, SKiso, YTanaka, TNakazato, HIshihara, TTakai, SYamamoto, DShiota, NMiyazaki, MOkunishi, HKinoshita, AUrata, HArakawa, K Substituted 3-(phenylsulfonyl)-1-phenylimidazolidine-2,4-dione derivatives as novel nonpeptide inhibitors of human heart chymase. J Med Chem 40:2156-63 (1997)  
Target
Name:
Chymotrypsinogen A
Synonyms:
Alpha-chymotrypsin Chymotrypsin A Chymotrypsin A chain B Chymotrypsinogen A | alpha-Chymotrypsin (α-Chymotrypsin)
Type:
Serine protease
Mol. Mass.:
25670.88
Organism:
Bos taurus (bovine)
Description:
Residue:
245
  
Inhibitor
Name:
BDBM50059007
Synonyms:
4-(2,5-Dioxo-3-phenyl-imidazolidine-1-sulfonyl)-benzoic acid methyl ester | CHEMBL69677
Type:
Small organic molecule
Emp. Form.:
C17H14N2O6S
Mol. Mass.:
374.368
SMILES:
COC(=O)c1ccc(cc1)S(=O)(=O)N1C(=O)CN(C1=O)c1ccccc1
: