Target
Somatostatin receptor type 5
Ligand
BDBM50059093
Substrate
Meas. Tech.
ChEMBL_200527 (CHEMBL806597)
IC50
0.77±n/a nM
Citation
 Melacini, GZhu, QOsapay, GGoodman, M A refined model for the somatostatin pharmacophore: conformational analysis of lanthionine-sandostatin analogs. J Med Chem 40:2252-8 (1997)  
Target
Name:
Somatostatin receptor type 5
Synonyms:
SOMATOSTATIN SST5 SS5-R SSR5_HUMAN Somatostatin receptor type 5 (SSTR5)
Type:
Enzyme
Mol. Mass.:
39218.02
Organism:
Homo sapiens (Human)
Description:
P35346
Residue:
364
  
Inhibitor
Name:
BDBM50059093
Synonyms:
2-{[10-(4-Amino-butyl)-19-(2-amino-3-phenyl-propionylamino)-16-benzyl-7-(1-hydroxy-ethyl)-13-(1H-indol-3-ylmethyl)-6,9,12,15,18-pentaoxo-1,2-dithia-5,8,11,14,17-pentaaza-cycloicosane-4-carbonyl]-amino}-3-hydroxy-butyric acid | CHEMBL415860
Type:
Small organic molecule
Emp. Form.:
C49H64N10O11S2
Mol. Mass.:
1033.223
SMILES:
C[C@@H](O)[C@@H](NC(=O)[C@H]1CSSC[C@H](NC(=O)[C@@H](N)Cc2ccccc2)C(=O)N[C@@H](Cc2ccccc2)C(=O)N[C@H](Cc2c[nH]c3ccccc23)C(=O)N[C@@H](CCCCN)C(=O)N[C@H]([C@@H](C)O)C(=O)N1)C(O)=O
: