Target
Tubulin beta-2B chain
Ligand
BDBM50005480
Substrate
Meas. Tech.
ChEMBL_211874 (CHEMBL819256)
IC50
530±n/a nM
Citation
 Chen, KKuo, SCHsieh, MCMauger, ALin, CMHamel, ELee, KH Antitumor agents. 174. 2',3',4',5,6,7-Substituted 2-phenyl-1,8-naphthyridin-4-ones: their synthesis, cytotoxicity, and inhibition of tubulin polymerization. J Med Chem 40:2266-75 (1997)  
Target
Name:
Tubulin beta-2B chain
Synonyms:
TBB2B_BOVIN Tubulin | Tubulin beta chain
Type:
PROTEIN
Mol. Mass.:
49932.38
Organism:
Bos taurus
Description:
ChEMBL_211651
Residue:
445
  
Inhibitor
Name:
BDBM50005480
Synonyms:
(-)-combretastatin (Z)-5-(3,4,5-trimethoxystyryl)-2-methoxyphenol (combretastin A-4)2-Methoxy-5-[2-(3,4,5-trimethoxy-phenyl)-vinyl]-phenol 2-Methoxy-5-[(Z)-2-(3,4,5-trimethoxy-phenyl)-vinyl]-phenol 2-methoxy-5-(3,4,5-trimethoxystyryl)phenol 5-(3,4,5-trimethoxystyryl)-2-methoxyphenol CHEMBL67 Combrestatin A4 Combretastatin Combretastin A-4 combretastatin A-4, (CSA4) | combretastin A4
Type:
Small organic molecule
Emp. Form.:
C18H20O5
Mol. Mass.:
316.3484
SMILES:
COc1ccc(\C=C/c2cc(OC)c(OC)c(OC)c2)cc1O
: