Target
Tubulin beta-2B chain
Ligand
BDBM50059111
Substrate
Meas. Tech.
ChEMBL_211874 (CHEMBL819256)
IC50
800±n/a nM
Citation
 Chen, KKuo, SCHsieh, MCMauger, ALin, CMHamel, ELee, KH Antitumor agents. 174. 2',3',4',5,6,7-Substituted 2-phenyl-1,8-naphthyridin-4-ones: their synthesis, cytotoxicity, and inhibition of tubulin polymerization. J Med Chem 40:2266-75 (1997)  
Target
Name:
Tubulin beta-2B chain
Synonyms:
TBB2B_BOVIN Tubulin | Tubulin beta chain
Type:
PROTEIN
Mol. Mass.:
49932.38
Organism:
Bos taurus
Description:
ChEMBL_211651
Residue:
445
  
Inhibitor
Name:
BDBM50059111
Synonyms:
2-(3-Methoxy-phenyl)-6-methyl-1H-[1,8]naphthyridin-4-one | CHEMBL298378
Type:
Small organic molecule
Emp. Form.:
C16H14N2O2
Mol. Mass.:
266.2946
SMILES:
COc1cccc(c1)-c1cc(O)c2cc(C)cnc2n1
: