Target
D(3) dopamine receptor
Ligand
BDBM50059228
Substrate
Meas. Tech.
ChEMBL_62435 (CHEMBL678864)
Ki
430±n/a nM
Citation
 Rowley, MCollins, IBroughton, HBDavey, WBBaker, REmms, FMarwood, RPatel, SPatel, SRagan, CIFreedman, SBBall, RLeeson, PD 4-Heterocyclylpiperidines as selective high-affinity ligands at the human dopamine D4 receptor. J Med Chem 40:2374-85 (1997)  
Target
Name:
D(3) dopamine receptor
Synonyms:
DOPAMINE D3 DRD3_HUMAN Dopamine D3 receptor (D3) Dopamine receptor Dopamine receptor D3
Type:
Mol. Mass.:
44243.43
Organism:
Homo sapiens (Human)
Description:
Residue:
400
  
Inhibitor
Name:
BDBM50059228
Synonyms:
1-Benzyl-4-[5-(4-chloro-phenyl)-4-methyl-1H-pyrazol-3-yl]-piperidine | CHEMBL309901
Type:
Small organic molecule
Emp. Form.:
C22H24ClN3
Mol. Mass.:
365.899
SMILES:
Cc1c([nH]nc1-c1ccc(Cl)cc1)C1CCN(Cc2ccccc2)CC1
: