Target
Trifunctional purine biosynthetic protein adenosine-3
Ligand
BDBM50059330
Substrate
Meas. Tech.
ChEMBL_72910 (CHEMBL684724)
Ki
15±n/a nM
Citation
 Varney, MDPalmer, CLRomines, WHBoritzki, TMargosiak, SAAlmassy, RJanson, CABartlett, CHowland, EJFerre, R Protein structure-based design, synthesis, and biological evaluation of 5-thia-2,6-diamino-4(3H)-oxopyrimidines: potent inhibitors of glycinamide ribonucleotide transformylase with potent cell growth inhibition. J Med Chem 40:2502-24 (1997)  
Target
Name:
Trifunctional purine biosynthetic protein adenosine-3
Synonyms:
GAR Tfase GART Glycinamide ribonucleotide transformylase (GAR Tfase) PRGS Thymidylate synthase/GAR transformylase/AICAR transformylase
Type:
Protein
Mol. Mass.:
107768.47
Organism:
Homo sapiens (Human)
Description:
P22102
Residue:
1010
  
Inhibitor
Name:
BDBM50059330
Synonyms:
(S)-2-({5-[2-(2-Amino-4-oxo-4,6,7,8-tetrahydro-3H-pyrimido[5,4-b][1,4]thiazin-6-yl)-ethyl]-4-methyl-thiophene-2-carbonyl}-amino)-pentanedioic acid | CHEMBL82390
Type:
Small organic molecule
Emp. Form.:
C19H23N5O6S2
Mol. Mass.:
481.546
SMILES:
Cc1cc(sc1CCC1CNc2nc(N)[nH]c(=O)c2S1)C(=O)N[C@@H](CCC(O)=O)C(O)=O
: