Target
Adenosine receptor A2a
Ligand
BDBM50454227
Substrate
Meas. Tech.
ChEMBL_30017 (CHEMBL641308)
Ki
38300±n/a nM
Citation
 Jiang, Jvan Rhee, AMChang, LPatchornik, AJi, XDEvans, PMelman, NJacobson, KA Structure-activity relationships of 4-(phenylethynyl)-6-phenyl-1,4-dihydropyridines as highly selective A3 adenosine receptor antagonists. J Med Chem 40:2596-608 (1997)  
Target
Name:
Adenosine receptor A2a
Synonyms:
AA2AR_RAT Adenosine A2 receptor Adenosine Receptors A2a (A2a) Adenosine receptors A2a Rat striatal adenosine A2a receptor
Type:
G Protein-Coupled Receptor (GPCR)
Mol. Mass.:
45015.65
Organism:
Rattus norvegicus (rat)
Description:
Rat A2A receptors expressed in CHO cells.
Residue:
410
  
Inhibitor
Name:
BDBM50454227
Synonyms:
CHEMBL2112340
Type:
Small organic molecule
Emp. Form.:
C20H21NO4
Mol. Mass.:
339.385
SMILES:
CCOC(=O)C1=C(C)NC(C)=C(C1C#Cc1ccccc1)C(=O)OC
: