Target
Adenosine receptor A3
Ligand
BDBM50059389
Substrate
Meas. Tech.
ChEMBL_32001 (CHEMBL646598)
Ki
296±n/a nM
Citation
 Jiang, Jvan Rhee, AMChang, LPatchornik, AJi, XDEvans, PMelman, NJacobson, KA Structure-activity relationships of 4-(phenylethynyl)-6-phenyl-1,4-dihydropyridines as highly selective A3 adenosine receptor antagonists. J Med Chem 40:2596-608 (1997)  
Target
Name:
Adenosine receptor A3
Synonyms:
A3 adenosine receptor (hA3) ADORA3 | Adenosine A3 receptor (A3AR)
Type:
G Protein-Coupled Receptor (GPCR)
Mol. Mass.:
36197.32
Organism:
Homo sapiens (Human)
Description:
P0DMS8
Residue:
318
  
Inhibitor
Name:
BDBM50059389
Synonyms:
2-Methyl-4-[(E)-2-(4-nitro-phenyl)-vinyl]-6-phenyl-1,4-dihydro-pyridine-3,5-dicarboxylic acid 3-allyl ester 5-ethyl ester | CHEMBL85410
Type:
Small organic molecule
Emp. Form.:
C27H26N2O6
Mol. Mass.:
474.5051
SMILES:
CCO\C([O-])=C1\C(\C=C\c2ccc(cc2)[N+]([O-])=O)C(C(=[OH+])OCC=C)=C(C)N=C1c1ccccc1
: