Target
Adenosine receptor A3
Ligand
BDBM50059399
Substrate
Meas. Tech.
ChEMBL_32001 (CHEMBL646598)
Ki
68±n/a nM
Citation
 Jiang, Jvan Rhee, AMChang, LPatchornik, AJi, XDEvans, PMelman, NJacobson, KA Structure-activity relationships of 4-(phenylethynyl)-6-phenyl-1,4-dihydropyridines as highly selective A3 adenosine receptor antagonists. J Med Chem 40:2596-608 (1997)  
Target
Name:
Adenosine receptor A3
Synonyms:
A3 adenosine receptor (hA3) ADORA3 | Adenosine A3 receptor (A3AR)
Type:
G Protein-Coupled Receptor (GPCR)
Mol. Mass.:
36197.32
Organism:
Homo sapiens (Human)
Description:
P0DMS8
Residue:
318
  
Inhibitor
Name:
BDBM50059399
Synonyms:
2-Methyl-6-phenyl-4-phenylethynyl-1,4-dihydro-pyridine-3,5-dicarboxylic acid 5-benzyl ester 3-propyl ester | CHEMBL89844
Type:
Small organic molecule
Emp. Form.:
C32H29NO4
Mol. Mass.:
491.577
SMILES:
CCCOC(=O)C1C(C#Cc2ccccc2)C(C(=O)OCc2ccccc2)=C(N=C1C)c1ccccc1
: