Target
Adenosine receptor A1
Ligand
BDBM50059415
Substrate
Meas. Tech.
ChEMBL_29470 (CHEMBL642199)
Ki
12600±n/a nM
Citation
 Jiang, Jvan Rhee, AMChang, LPatchornik, AJi, XDEvans, PMelman, NJacobson, KA Structure-activity relationships of 4-(phenylethynyl)-6-phenyl-1,4-dihydropyridines as highly selective A3 adenosine receptor antagonists. J Med Chem 40:2596-608 (1997)  
Target
Name:
Adenosine receptor A1
Synonyms:
AA1R_RAT ADENOSINE A1 high Adenosine A1 receptor (A1) Adenosine receptors A1 | Adora1
Type:
Protein
Mol. Mass.:
36704.13
Organism:
Rattus norvegicus (rat)
Description:
Residue:
326
  
Inhibitor
Name:
BDBM50059415
Synonyms:
5-Acetyl-6-methyl-2-phenyl-4-phenylethynyl-1,4-dihydro-pyridine-3-carboxylic acid ethyl ester | CHEMBL89343
Type:
Small organic molecule
Emp. Form.:
C25H23NO3
Mol. Mass.:
385.455
SMILES:
CCOC(=O)C1=C(N=C(C)C(C1C#Cc1ccccc1)C(C)=O)c1ccccc1
: