Target
Adenosine receptor A3
Ligand
BDBM50059410
Substrate
Meas. Tech.
ChEMBL_32001 (CHEMBL646598)
Ki
1040±n/a nM
Citation
 Jiang, Jvan Rhee, AMChang, LPatchornik, AJi, XDEvans, PMelman, NJacobson, KA Structure-activity relationships of 4-(phenylethynyl)-6-phenyl-1,4-dihydropyridines as highly selective A3 adenosine receptor antagonists. J Med Chem 40:2596-608 (1997)  
Target
Name:
Adenosine receptor A3
Synonyms:
A3 adenosine receptor (hA3) ADORA3 | Adenosine A3 receptor (A3AR)
Type:
G Protein-Coupled Receptor (GPCR)
Mol. Mass.:
36197.32
Organism:
Homo sapiens (Human)
Description:
P0DMS8
Residue:
318
  
Inhibitor
Name:
BDBM50059410
Synonyms:
2-Methyl-6-phenyl-4-thiophen-2-yl-1,4-dihydro-pyridine-3,5-dicarboxylic acid diethyl ester | CHEMBL315720
Type:
Small organic molecule
Emp. Form.:
C22H23NO4S
Mol. Mass.:
397.487
SMILES:
CCOC(=O)C1C(c2cccs2)C(C(=O)OCC)=C(N=C1C)c1ccccc1
: