Target
11-beta-hydroxysteroid dehydrogenase 1
Ligand
BDBM50507371
Substrate
Meas. Tech.
ChEMBL_1829814 (CHEMBL4329688)
Ki
0.900000±n/a nM
Citation
 Li, JKennedy, LJWalker, SJWang, HLi, JJHong, ZO'Connor, SPYe, XYChen, SWu, SYoon, DSNayeem, ACamac, DMRamamurthy, VMorin, PESheriff, SWang, MHarper, TWGolla, RSeethala, RHarrity, TPonticiello, RPMorgan, NNTaylor, JRZebo, RMaxwell, BMoulin, FGordon, DARobl, JA Discovery of Clinical Candidate BMS-823778 as an Inhibitor of Human 11?-Hydroxysteroid Dehydrogenase Type 1 (11?-HSD-1). ACS Med Chem Lett 9:1170-1174 (2018)  
Target
Name:
11-beta-hydroxysteroid dehydrogenase 1
Synonyms:
11-DH 11-beta-Hydroxysteroid Dehydrogenase 1 (11-beta-HSD1) 11-beta-hydroxysteroid dehydrogenase 1 (11HSD1) Corticosteroid 11-beta-dehydrogenase isozyme 1 (11-beta-HSD-1) Corticosteroid 11-beta-dehydrogenase isozyme 1 (11beta-HSD1) HSD11 HSD11L | SDR26C1
Type:
Enzyme
Mol. Mass.:
32409.16
Organism:
Homo sapiens (Human)
Description:
P28845
Residue:
292
  
Inhibitor
Name:
BDBM50507371
Synonyms:
BMS-823778
Type:
Small organic molecule
Emp. Form.:
C18H18ClN3O
Mol. Mass.:
327.808
SMILES:
CC(C)(O)c1cccn2c(nnc12)C1(CC1)c1ccc(Cl)cc1
: