Target
5-hydroxytryptamine receptor 2C
Ligand
BDBM50059893
Substrate
Meas. Tech.
ChEMBL_2803 (CHEMBL617655)
EC50
2000±n/a nM
Citation
 Monte, APWaldman, SRMarona-Lewicka, DWainscott, DBNelson, DLSanders-Bush, ENichols, DE Dihydrobenzofuran analogues of hallucinogens. 4. Mescaline derivatives. J Med Chem 40:2997-3008 (1997)  
Target
Name:
5-hydroxytryptamine receptor 2C
Synonyms:
5-HT2C 5-hydroxytryptamine receptor 2C (5HT2c) 5ht1c Htr2c Serotonin receptor 2a and 2c (5HT2A and 5HT2C)
Type:
Enzyme
Mol. Mass.:
51935.10
Organism:
Rattus norvegicus (Rat)
Description:
P08909
Residue:
460
  
Inhibitor
Name:
BDBM50059893
Synonyms:
2-(4-Ethoxy-3,5-dimethoxy-phenyl)-ethylamine | CHEMBL319415
Type:
Small organic molecule
Emp. Form.:
C12H19NO3
Mol. Mass.:
225.2842
SMILES:
CCOc1c(OC)cc(CCN)cc1OC
: