Target
Dihydrofolate reductase
Ligand
BDBM50059933
Substrate
Meas. Tech.
ChEMBL_54958 (CHEMBL669028)
IC50
13000±n/a nM
Citation
 Gangjee, AVasudevan, AQueener, SF Conformationally restricted analogues of trimethoprim: 2,6-diamino-8-substituted purines as potential dihydrofolate reductase inhibitors from Pneumocystis carinii and Toxoplasma gondii. J Med Chem 40:3032-9 (1997)  
Target
Name:
Dihydrofolate reductase
Synonyms:
DYR_RAT Dihydrofolate reductase (DHFR) Tetrahydrofolate dehydrogenase
Type:
Enzyme
Mol. Mass.:
21638.84
Organism:
Rattus norvegicus (rat)
Description:
Residue:
187
  
Inhibitor
Name:
BDBM50059933
Synonyms:
8-(3,4,5-Trimethoxy-phenyl)-9H-purine-2,6-diamine CHEMBL431257
Type:
Small organic molecule
Emp. Form.:
C14H16N6O3
Mol. Mass.:
316.3152
SMILES:
COc1cc(cc(OC)c1OC)-c1nc2nc(N)nc(N)c2[nH]1
: