Target
Cholecystokinin receptor type A
Ligand
BDBM50060325
Substrate
Meas. Tech.
ChEMBL_47650 (CHEMBL657362)
Ki
1030±n/a nM
Citation
 Martín-Martínez, MBartolomé-Nebreda, JMGómez-Monterrey, IGonzález-Muñiz, RGarcía-López, MTBallaz, SBarber, AFortuño, ADel Río, JHerranz, R Synthesis and stereochemical structure-activity relationships of 1,3-dioxoperhydropyrido[1,2-c]pyrimidine derivatives: potent and selective cholecystokinin-A receptor antagonists. J Med Chem 40:3402-7 (1997)  
Target
Name:
Cholecystokinin receptor type A
Synonyms:
CCKAR_RAT Cholecystokinin peripheral Cholecystokinin receptor type A
Type:
Enzyme Catalytic Domain
Mol. Mass.:
49676.37
Organism:
RAT
Description:
Cholecystokinin central 0 RAT::P30551
Residue:
444
  
Inhibitor
Name:
BDBM50060325
Synonyms:
(2S,8S,8aR)-2-Benzyl-8-[(S)-2-tert-butoxycarbonylamino-3-(1H-indol-3-yl)-propionylamino]-3-oxo-octahydro-indolizine-2-carboxylic acid methyl ester | CHEMBL113699
Type:
Small organic molecule
Emp. Form.:
C33H40N4O6
Mol. Mass.:
588.6939
SMILES:
COC(=O)[C@@]1(Cc2ccccc2)C[C@@H]2[C@H](CCCN2C1=O)NC(=O)[C@H](Cc1c[nH]c2ccccc12)NC(=O)OC(C)(C)C
: