Target
5-hydroxytryptamine receptor 1D
Ligand
BDBM50060428
Substrate
Meas. Tech.
ChEMBL_1697 (CHEMBL616904)
IC50
1.3±n/a nM
Citation
 Castro, JLStreet, LJGuiblin, ARJelley, RARussell, MGSternfeld, FBeer, MSStanton, JAMatassa, VG 3-[2-(Pyrrolidin-1-yl)ethyl]indoles and 3-[3-(piperidin-1-yl)propyl]indoles: agonists for the h5-HT1D receptor with high selectivity over the h5-HT1B subtype. J Med Chem 40:3497-500 (1997)  
Target
Name:
5-hydroxytryptamine receptor 1D
Synonyms:
5-HT-1D 5-HT1D 5HT1D_HUMAN HTR1DA Serotonin (5-HT) receptor | Serotonin Receptor 1D
Type:
G Protein-Coupled Receptor (GPCR)
Mol. Mass.:
41920.63
Organism:
Homo sapiens (Human)
Description:
Receptor binding assays were performed using human clone stably expressed in CHO cells.
Residue:
377
  
Inhibitor
Name:
BDBM50060428
Synonyms:
(R)-2-Phenyl-2-{1-[3-(5-[1,2,4]triazol-4-yl-1H-indol-3-yl)-propyl]-piperidin-4-ylamino}-ethanol | CHEMBL118012
Type:
Small organic molecule
Emp. Form.:
C26H32N6O
Mol. Mass.:
444.5719
SMILES:
OC[C@H](NC1CCN(CCCc2c[nH]c3ccc(cc23)-n2cnnc2)CC1)c1ccccc1
: