Target
5-hydroxytryptamine receptor 1B
Ligand
BDBM50060421
Substrate
Meas. Tech.
ChEMBL_1612 (CHEMBL616637)
IC50
125±n/a nM
Citation
 Castro, JLStreet, LJGuiblin, ARJelley, RARussell, MGSternfeld, FBeer, MSStanton, JAMatassa, VG 3-[2-(Pyrrolidin-1-yl)ethyl]indoles and 3-[3-(piperidin-1-yl)propyl]indoles: agonists for the h5-HT1D receptor with high selectivity over the h5-HT1B subtype. J Med Chem 40:3497-500 (1997)  
Target
Name:
5-hydroxytryptamine receptor 1B
Synonyms:
5-HT-1B 5-HT1B 5HT1B_HUMAN HTR1DB Serotonin (5-HT) receptor Serotonin Receptor 1B
Type:
G Protein-Coupled Receptor (GPCR)
Mol. Mass.:
43579.17
Organism:
Homo sapiens (Human)
Description:
Receptor binding assays were performed using human clone stably expressed in CHO cells
Residue:
390
  
Inhibitor
Name:
BDBM50060421
Synonyms:
Benzyl-{1-[3-(5-[1,2,4]triazol-4-yl-1H-indol-3-yl)-propyl]-piperidin-4-yl}-amine | CHEMBL117046
Type:
Small organic molecule
Emp. Form.:
C25H30N6
Mol. Mass.:
414.5459
SMILES:
C(CN1CCC(CC1)NCc1ccccc1)Cc1c[nH]c2ccc(cc12)-n1cnnc1
: