Target
Endothelin-1 receptor
Ligand
BDBM50061074
Substrate
Meas. Tech.
ChEMBL_65471 (CHEMBL873596)
IC50
0.078000±n/a nM
Citation
 Jae, HSWinn, MDixon, DBMarsh, KCNguyen, BOpgenorth, TJvon Geldern, TW Pyrrolidine-3-carboxylic acids as endothelin antagonists. 2. Sulfonamide-based ETA/ETB mixed antagonists. J Med Chem 40:3217-27 (1997)  
Target
Name:
Endothelin-1 receptor
Synonyms:
EDNRA ET-A ETA-R Endothelin receptor type A hET-AR
Type:
Enzyme Catalytic Domain
Mol. Mass.:
48736.88
Organism:
Homo sapiens (Human)
Description:
P25101
Residue:
427
  
Inhibitor
Name:
BDBM50061074
Synonyms:
(2R,3R,4S)-4-Benzo[1,3]dioxol-5-yl-2-(3-fluoro-4-methoxy-phenyl)-1-{2-[(pentane-1-sulfonyl)-propyl-amino]-ethyl}-pyrrolidine-3-carboxylic acid CHEMBL111277
Type:
Small organic molecule
Emp. Form.:
C29H39FN2O7S
Mol. Mass.:
578.693
SMILES:
CCCCCS(=O)(=O)N(CCC)CCN1C[C@@H]([C@H]([C@@H]1c1ccc(OC)c(F)c1)C(O)=O)c1ccc2OCOc2c1
: