Target
Cannabinoid receptor 1
Ligand
BDBM50061111
Substrate
Meas. Tech.
ChEMBL_46617 (CHEMBL658203)
EC50
0.580000±n/a nM
Citation
 Rhee, MHVogel, ZBarg, JBayewitch, MLevy, RHanus, LBreuer, AMechoulam, R Cannabinol derivatives: binding to cannabinoid receptors and inhibition of adenylylcyclase. J Med Chem 40:3228-33 (1997)  
Target
Name:
Cannabinoid receptor 1
Synonyms:
Brain-type cannabinoid receptor CB-R CNR1_RAT Cannabinoid receptor Cnr1 | Skr6
Type:
G Protein-Coupled Receptor (GPCR)
Mol. Mass.:
52856.55
Organism:
Rattus norvegicus (rat)
Description:
P20272
Residue:
473
  
Inhibitor
Name:
BDBM50061111
Synonyms:
(R)-3-(1,1-Dimethyl-heptyl)-6,6,9-trimethyl-6a,7,8,10a-tetrahydro-6H-benzo[c]chromen-1-ol | CHEMBL111148
Type:
Small organic molecule
Emp. Form.:
C25H38O2
Mol. Mass.:
370.568
SMILES:
CCCCCCC(C)(C)c1cc(O)c2C3C=C(C)CC[C@H]3C(C)(C)Oc2c1
: