Target
Serine protease 1
Ligand
BDBM26658
Substrate
Meas. Tech.
ChEMBL_212193 (CHEMBL817756)
IC50
110800±n/a nM
Citation
 Checa, AOrtiz, ARde Pascual-Teresa, BGago, F Assessment of solvation effects on calculated binding affinity differences: trypsin inhibition by flavonoids as a model system for congeneric series. J Med Chem 40:4136-45 (1998)  
Target
Name:
Serine protease 1
Synonyms:
Beta-Trypsin PRSS1 TRY1 TRYP1 Trypsin I
Type:
Enzyme
Mol. Mass.:
25790.52
Organism:
Bos taurus (bovine)
Description:
P00760
Residue:
246
  
Inhibitor
Name:
BDBM26658
Synonyms:
2-(2,4-dihydroxyphenyl)-3,5,7-trihydroxy-1-benzopyran-4-one 2-(2,4-dihydroxyphenyl)-3,5,7-trihydroxy-chromone 2-[2,4-bis(oxidanyl)phenyl]-3,5,7-tris(oxidanyl)chromen-4-one MLS000069618 Morin (5) SMR000058259 morin
Type:
Flavonoid
Emp. Form.:
C15H10O7
Mol. Mass.:
302.2357
SMILES:
Oc1ccc(c(O)c1)-c1oc2cc(O)cc(O)c2c(=O)c1O
: