Target
Retinoic acid receptor RXR-beta
Ligand
BDBM50061615
Substrate
Meas. Tech.
ChEMBL_196505 (CHEMBL798319)
Ki
1700±n/a nM
Citation
 Umemiya, HFukasawa, HEbisawa, MEyrolles, LKawachi, EEisenmann, GGronemeyer, HHashimoto, YShudo, KKagechika, H Regulation of retinoidal actions by diazepinylbenzoic acids. Retinoid synergists which activate the RXR-RAR heterodimers. J Med Chem 40:4222-34 (1998)  
Target
Name:
Retinoic acid receptor RXR-beta
Synonyms:
NR2B2 RXRB Retinoic acid receptor RXR-beta Retinoid receptor
Type:
PROTEIN
Mol. Mass.:
56932.89
Organism:
Homo sapiens (Human)
Description:
ChEMBL_39045
Residue:
533
  
Inhibitor
Name:
BDBM50061615
Synonyms:
4-(10,10,13,13,15-Pentamethyl-11,12,13,15-tetrahydro-10H-8,15-diaza-cyclohepta[2,1-a;4,5-b']dinaphthalen-7-yl)-benzoic acid | CHEMBL298373
Type:
Small organic molecule
Emp. Form.:
C33H32N2O2
Mol. Mass.:
488.6194
SMILES:
CN1c2cc3c(cc2N=C(c2ccc(cc2)C(O)=O)c2ccc4ccccc4c12)C(C)(C)CCC3(C)C
: