Target
Muscarinic acetylcholine receptor M4
Ligand
BDBM50061705
Substrate
Meas. Tech.
ChEMBL_139114 (CHEMBL749238)
IC50
90±n/a nM
Citation
 Bromidge, SMBrown, FCassidy, FClark, MSDabbs, SHadley, MSHawkins, JLoudon, JMNaylor, CBOrlek, BSRiley, GJ Design of [R-(Z)]-(+)-alpha-(methoxyimino)-1-azabicyclo[2.2.2]octane-3-acetonitri le (SB 202026), a functionally selective azabicyclic muscarinic M1 agonist incorporating the N-methoxy imidoyl nitrile group as a novel ester bioisostere. J Med Chem 40:4265-80 (1998)  
Target
Name:
Muscarinic acetylcholine receptor M4
Synonyms:
ACM4_HUMAN Cholinergic, muscarinic M4 Muscarinic acetylcholine receptor M2 and M4
Type:
Enzyme Catalytic Domain
Mol. Mass.:
53079.31
Organism:
Homo sapiens (Human)
Description:
Cholinergic, muscarinic M4 CHRM4 HUMAN M3::P08173
Residue:
479
  
Inhibitor
Name:
BDBM50061705
Synonyms:
(R)-1-Aza-bicyclo[2.2.2]oct-3-yl-[(Z)-methoxyimino]-acetonitrile SB-202026
Type:
Small organic molecule
Emp. Form.:
C10H15N3O
Mol. Mass.:
193.2456
SMILES:
CO\N=C(/C#N)[C@H]1CN2CCC1CC2
: