Target
Reverse transcriptase/RNaseH
Ligand
BDBM50061983
Substrate
Meas. Tech.
ChEMBL_195536 (CHEMBL800983)
IC50
>30000±n/a nM
Citation
 Qiu, YLKsebati, MBPtak, RGFan, BYBreitenbach, JMLin, JSCheng, YCKern, ERDrach, JCZemlicka, J (Z)- and (E)-2-((hydroxymethyl)cyclopropylidene)methyladenine and -guanine. New nucleoside analogues with a broad-spectrum antiviral activity. J Med Chem 41:10-23 (1998)  
Target
Name:
Reverse transcriptase/RNaseH
Synonyms:
HIV-1 Reverse Transcriptase RNase H Reverse transcriptase/RNaseH
Type:
PROTEIN
Mol. Mass.:
65229.15
Organism:
Human immunodeficiency virus 1
Description:
ChEMBL_1473730
Residue:
566
  
Inhibitor
Name:
BDBM50061983
Synonyms:
2-Amino-9-[2-hydroxymethyl-cycloprop-(E)-ylidenemethyl]-1,9-dihydro-purin-6-one | CHEMBL75956
Type:
Small organic molecule
Emp. Form.:
C10H11N5O2
Mol. Mass.:
233.2266
SMILES:
Nc1nc2n(\C=C3/CC3CO)cnc2c(=O)[nH]1
: